Target
Mineralocorticoid receptor
Ligand
BDBM50151072
Substrate
Meas. Tech.
ChEMBL_302632 (CHEMBL839923)
Ki
>1000±n/a nM
Citation
 von Geldern, TWTu, NKym, PRLink, JTJae, HSLai, CApelqvist, TRhonnstad, PHagberg, LKoehler, KGrynfarb, MGoos-Nilsson, ASandberg, JOsterlund, MBarkhem, THöglund, MWang, JFung, SWilcox, DNguyen, PJakob, CHutchins, CFärnegårdh, MKauppi, BOhman, LJacobson, PB Liver-selective glucocorticoid antagonists: a novel treatment for type 2 diabetes. J Med Chem 47:4213-30 (2004)  
Target
Name:
Mineralocorticoid receptor
Synonyms:
MCR MLR NR3C2 | Nuclear receptor subfamily 3 group C member 2
Type:
Enzyme
Mol. Mass.:
107076.42
Organism:
Homo sapiens (Human)
Description:
P08235
Residue:
984
  
Inhibitor
Name:
BDBM50151072
Synonyms:
(4R)-4-[(1S,2S,5R,6R,7R,9R,10R,11S,14R,15R,16S)-6-[3-({4-[(10S,11S,14R,15S,17R)-14-ethynyl-14-hydroxy-15-methyl-5-oxotetracyclo[8.7.0.0^{2,7}.0^{11,15}]heptadeca-1,6-dien-17-yl]phenyl}(methyl)amino)propyl]-5,9,16-trihydroxy-2,15-dimethyltetracyclo[8.7.0.0^{2,7}.0^{11,15}]heptadecan-14-yl]pentanoic acid | CHEMBL440251
Type:
Small organic molecule
Emp. Form.:
C54H75NO7
Mol. Mass.:
850.1758
SMILES:
C[C@H](CCC(O)=O)[C@H]1CC[C@H]2[C@@H]3[C@H](O)C[C@@H]4[C@@H](CCCN(C)c5ccc(cc5)[C@H]5C[C@@]6(C)[C@@H](CC[C@@]6(O)C#C)[C@@H]6CCC7=CC(=O)CCC7=C56)[C@H](O)CC[C@]4(C)[C@H]3C[C@H](O)[C@]12C
: