Target
Steryl-sulfatase
Ligand
BDBM50151135
Substrate
Meas. Tech.
ChEMBL_302762 (CHEMBL838826)
Ki
2200±n/a nM
Citation
 Horvath, ANussbaumer, PWolff, BBillich, A 2-(1-adamantyl)-4-(thio)chromenone-6-carboxylic acids: potent reversible inhibitors of human steroid sulfatase. J Med Chem 47:4268-76 (2004)  
Target
Name:
Steryl-sulfatase
Synonyms:
ARSC1 Arylsulfatase C STS_HUMAN Steryl-sulfate sulfohydrolase
Type:
Enzyme
Mol. Mass.:
65503.66
Organism:
Homo sapiens (Human)
Description:
P08842
Residue:
583
  
Inhibitor
Name:
BDBM50151135
Synonyms:
(2-Adamantan-1-yl-4-oxo-4H-chromen-6-yl)-oxo-acetic acid | CHEMBL188214
Type:
Small organic molecule
Emp. Form.:
C21H20O5
Mol. Mass.:
352.3805
SMILES:
OC(=O)C(=O)c1ccc2oc(cc(=O)c2c1)C12CC3CC(CC(C3)C1)C2
: