Target
P2Y purinoceptor 1
Ligand
BDBM50410189
Substrate
Meas. Tech.
ChEMBL_310399 (CHEMBL833177)
EC50
1±n/a nM
Citation
 Major, DTNahum, VWang, YReiser, GFischer, B Molecular recognition in purinergic receptors. 2. Diastereoselectivity of the h-P2Y1-receptor. J Med Chem 47:4405-16 (2004)  
Target
Name:
P2Y purinoceptor 1
Synonyms:
ATP receptor P2Y1 Purinergic receptor | Purinergic receptor P2Y1
Type:
PROTEIN
Mol. Mass.:
42338.46
Organism:
Rattus norvegicus
Description:
ChEMBL_873671
Residue:
373
  
Inhibitor
Name:
BDBM50410189
Synonyms:
CHEMBL2093075
Type:
Small organic molecule
Emp. Form.:
C11H18N5O12P3S2
Mol. Mass.:
569.338
SMILES:
CSc1nc(N)c2ncn(C3O[C@H](CO[P@](O)(=S)OP(O)(=O)OP(O)(O)=O)[C@@H](O)[C@H]3O)c2n1
: