Target
Cholecystokinin receptor type A
Ligand
BDBM21147
Substrate
Meas. Tech.
ChEMBL_306072 (CHEMBL833027)
IC50
1.04±n/a nM
Citation
 Muñoz-Ruiz, PGarcía-López, MTCenarruzabeitia, EDel Río, JDufresne, MFoucaud, MFourmy, DHerranz, R 5-(tryptophylamino)-1,3-dioxoperhydropyrido[1,2-c]pyrimidine-based cholecystokinin receptor antagonists: reversal of CCK1 receptor subtype selectivity toward CCK2 receptors. J Med Chem 47:5318-29 (2004)  
Target
Name:
Cholecystokinin receptor type A
Synonyms:
CCKAR_RAT Cholecystokinin peripheral Cholecystokinin receptor type A
Type:
Enzyme Catalytic Domain
Mol. Mass.:
49676.37
Organism:
RAT
Description:
Cholecystokinin central 0 RAT::P30551
Residue:
444
  
Inhibitor
Name:
BDBM21147
Synonyms:
(3S)-3-[(2S)-2-[(2S)-2-{2-[(2S)-2-[(2S)-2-[(3S)-3-amino-3-formamidopropanoic acid]-3-[4-(sulfooxy)phenyl]propanamido]-4-(methylsulfanyl)butanamido]acetamido}-3-(1H-indol-3-yl)propanamido]-4-(methylsulfanyl)butanamido]-3-{[(1S)-1-carbamoyl-2-phenylethyl]carbamoyl}propanoic acid CCK-8(SO3) H-Asp-Tyr(SO3H)-Met-Gly-Trp-Met-Asp-Phe-NH2 Syncalide | [125I]CCK-8
Type:
radiolabeled ligand
Emp. Form.:
C49H62N10O16S3
Mol. Mass.:
1143.269
SMILES:
CSCC[C@H](NC(=O)[C@H](Cc1ccc(OS(O)(=O)=O)cc1)NC(=O)[C@@H](N)CC(O)=O)C(=O)NCC(=O)N[C@@H](Cc1c[nH]c2ccccc12)C(=O)N[C@@H](CCSC)C(=O)N[C@@H](CC(O)=O)C(=O)N[C@@H](Cc1ccccc1)C(N)=O
: