Target
Gastrin/cholecystokinin type B receptor
Ligand
BDBM50154426
Substrate
Meas. Tech.
ChEMBL_312857 (CHEMBL874936)
IC50
1763±n/a nM
Citation
 Muñoz-Ruiz, PGarcía-López, MTCenarruzabeitia, EDel Río, JDufresne, MFoucaud, MFourmy, DHerranz, R 5-(tryptophylamino)-1,3-dioxoperhydropyrido[1,2-c]pyrimidine-based cholecystokinin receptor antagonists: reversal of CCK1 receptor subtype selectivity toward CCK2 receptors. J Med Chem 47:5318-29 (2004)  
Target
Name:
Gastrin/cholecystokinin type B receptor
Synonyms:
CCK-2 receptor CCK-BR CCKRB Cholecystokinin receptor GASR_HUMAN | Gastrin/cholecystokinin type B receptor
Type:
G Protein-Coupled Receptor (GPCR)
Mol. Mass.:
48445.79
Organism:
Homo sapiens (Human)
Description:
Stable expression of human CCK-2 receptors in HEK 293 cells.
Residue:
447
  
Inhibitor
Name:
BDBM50154426
Synonyms:
(S)-2-((4R,5R)-2-Benzyl-4-methyl-1,3-dioxo-octahydro-pyrido[1,2-c]pyrimidin-5-ylamino)-3-(1H-indol-3-yl)-propionic acid adamantan-2-yl ester | CHEMBL359589
Type:
Small organic molecule
Emp. Form.:
C37H44N4O4
Mol. Mass.:
608.7697
SMILES:
C[C@@H]1C2[C@@H](CCCN2C(=O)N(Cc2ccccc2)C1=O)N[C@@H](Cc1c[nH]c2ccccc12)C(=O)OC1C2CC3CC(C2)CC1C3
: