Target
Cholecystokinin receptor type A
Ligand
BDBM50154438
Substrate
Meas. Tech.
ChEMBL_306072 (CHEMBL833027)
IC50
22.7±n/a nM
Citation
 Muñoz-Ruiz, PGarcía-López, MTCenarruzabeitia, EDel Río, JDufresne, MFoucaud, MFourmy, DHerranz, R 5-(tryptophylamino)-1,3-dioxoperhydropyrido[1,2-c]pyrimidine-based cholecystokinin receptor antagonists: reversal of CCK1 receptor subtype selectivity toward CCK2 receptors. J Med Chem 47:5318-29 (2004)  
Target
Name:
Cholecystokinin receptor type A
Synonyms:
CCKAR_RAT Cholecystokinin peripheral Cholecystokinin receptor type A
Type:
Enzyme Catalytic Domain
Mol. Mass.:
49676.37
Organism:
RAT
Description:
Cholecystokinin central 0 RAT::P30551
Residue:
444
  
Inhibitor
Name:
BDBM50154438
Synonyms:
(S)-2-((R)-2-Benzyl-1,3-dioxo-octahydro-pyrido[1,2-c]pyrimidin-5-ylamino)-3-(1H-indol-3-yl)-propionic acid tert-butyl ester | CHEMBL363106
Type:
Small organic molecule
Emp. Form.:
C30H36N4O4
Mol. Mass.:
516.6312
SMILES:
CC(C)(C)OC(=O)[C@H](Cc1c[nH]c2ccccc12)N[C@@H]1CCCN2C1CC(=O)N(Cc1ccccc1)C2=O
: