Target
Gag-Pol polyprotein [489-587]
Ligand
BDBM50156153
Substrate
Meas. Tech.
ChEMBL_302776 (CHEMBL838839)
Ki
1.4±n/a nM
Citation
 Shuman, CFVrang, LDanielson, UH Improved structure-activity relationship analysis of HIV-1 protease inhibitors using interaction kinetic data. J Med Chem 47:5953-61 (2004)  
Target
Name:
Gag-Pol polyprotein [489-587]
Synonyms:
Human immunodeficiency virus type 1 protease Pol polyprotein | gag-pol
Type:
Enzyme Subunit
Mol. Mass.:
10781.16
Organism:
Human immunodeficiency virus type 1
Description:
P04585[489-587]
Residue:
99
  
Inhibitor
Name:
BDBM50156153
Synonyms:
1,6-Bis-(2,3-dimethyl-butyrylamino)-3,4-dihydroxy-5-(3''-nitro-biphenyl-4-yloxy)-1,6-dioxo-hexan-2-ol anion
Type:
Small organic molecule
Emp. Form.:
C30H38N3O10
Mol. Mass.:
600.6374
SMILES:
CC(C)[C@H](C)C(=O)NC(=O)[C@H]([O-])[C@H](O)[C@@H](O)[C@@H](Oc1ccc(cc1)-c1cccc(c1)[N+]([O-])=O)C(=O)NC(=O)[C@@H](C)C(C)C
: