Target
Type-2 angiotensin II receptor
Ligand
BDBM50156178
Substrate
Meas. Tech.
ChEMBL_303706 (CHEMBL829041)
Ki
2.1±n/a nM
Citation
 Johannesson, PErdélyi, MLindeberg, GFrändberg, PANyberg, FKarlén, AHallberg, A AT2-selective angiotensin II analogues containing tyrosine-functionalized 5,5-bicyclic thiazabicycloalkane dipeptide mimetics. J Med Chem 47:6009-19 (2004)  
Target
Name:
Type-2 angiotensin II receptor
Synonyms:
AGTR2 AT2 Angiotensin II type 2 (AT-2) receptor Type-2 angiotensin II receptor
Type:
Enzyme Catalytic Domain
Mol. Mass.:
41201.61
Organism:
Homo sapiens (Human)
Description:
Angiotensin II, central 0 0::P50052
Residue:
363
  
Inhibitor
Name:
BDBM50156178
Synonyms:
CHEMBL216331 | c[Hcy3,5]Ang II
Type:
Small organic molecule
Emp. Form.:
C47H65N13O12S2
Mol. Mass.:
1068.229
SMILES:
N[C@@H](CC(O)=O)C(=O)N[C@@H](CCCNC(N)=N)C(=O)N[C@@H](CCS)C(=O)N[C@@H](Cc1ccc(O)cc1)C(=O)N[C@@H](CCS)C(=O)N[C@@H](Cc1cnc[nH]1)C(=O)N1CCC[C@H]1C(=O)N[C@@H](Cc1ccccc1)C(O)=O
: