Target
Cytochrome P450 2D6
Ligand
BDBM50158925
Substrate
Meas. Tech.
ChEMBL_305742 (CHEMBL829414)
IC50
12900±n/a nM
Citation
 Denton, TTZhang, XCashman, JR 5-substituted, 6-substituted, and unsubstituted 3-heteroaromatic pyridine analogues of nicotine as selective inhibitors of cytochrome P-450 2A6. J Med Chem 48:224-39 (2005)  
Target
Name:
Cytochrome P450 2D6
Synonyms:
CP2D6_HUMAN CYP2DL1 Cytochrome P450 2D6 (CYP2D6) P450-DB1
Type:
Protein
Mol. Mass.:
55774.82
Organism:
Homo sapiens (Human)
Description:
P10635
Residue:
497
  
Inhibitor
Name:
BDBM50158925
Synonyms:
Bis-(5-pyridin-3-yl-thiophen-2-ylmethyl)-amine | CHEMBL178711
Type:
Small organic molecule
Emp. Form.:
C20H17N3S2
Mol. Mass.:
363.499
SMILES:
C(NCc1ccc(s1)-c1cccnc1)c1ccc(s1)-c1cccnc1
: