Target
Sigma non-opioid intracellular receptor 1
Ligand
BDBM50159017
Substrate
Meas. Tech.
ChEMBL_303199 (CHEMBL829825)
Ki
28.7±n/a nM
Citation
 Costantino, LGandolfi, FSorbi, CFranchini, SPrezzavento, OVittorio, FRonsisvalle, GLeonardi, APoggesi, EBrasili, L Synthesis and structure-activity relationships of 1-aralkyl-4-benzylpiperidine and 1-aralkyl-4-benzylpiperazine derivatives as potent sigma ligands. J Med Chem 48:266-73 (2005)  
Target
Name:
Sigma non-opioid intracellular receptor 1
Synonyms:
Aging-associated gene 8 protein SGMR1_HUMAN SIGMAR1 SR31747-binding protein Sigma 1-type opioid receptor Sigma1R | hSigmaR1
Type:
Enzyme Catalytic Domain
Mol. Mass.:
25124.85
Organism:
Homo sapiens (Human)
Description:
Q99720
Residue:
223
  
Inhibitor
Name:
BDBM50159017
Synonyms:
4-Benzyl-1-(6,7,8,9-tetrahydro-5H-benzocyclohepten-6-ylmethyl)-piperidine | CHEMBL179808
Type:
Small organic molecule
Emp. Form.:
C24H31N
Mol. Mass.:
333.5096
SMILES:
C(C1CCCc2ccccc2C1)N1CCC(Cc2ccccc2)CC1
: