Target
D(2) dopamine receptor
Ligand
BDBM50159015
Substrate
Meas. Tech.
ChEMBL_302694 (CHEMBL839567)
Ki
3.61±n/a nM
Citation
 Costantino, LGandolfi, FSorbi, CFranchini, SPrezzavento, OVittorio, FRonsisvalle, GLeonardi, APoggesi, EBrasili, L Synthesis and structure-activity relationships of 1-aralkyl-4-benzylpiperidine and 1-aralkyl-4-benzylpiperazine derivatives as potent sigma ligands. J Med Chem 48:266-73 (2005)  
Target
Name:
D(2) dopamine receptor
Synonyms:
DOPAMINE D2 DOPAMINE D2 Short Dopamine D2 receptor Drd2
Type:
G Protein-Coupled Receptor (GPCR)
Mol. Mass.:
50931.60
Organism:
Rattus norvegicus (rat)
Description:
P61169
Residue:
444
  
Inhibitor
Name:
BDBM50159015
Synonyms:
4-Benzyl-1-(2,3-dihydro-benzo[1,4]dioxin-2-ylmethyl)-piperidine | CHEMBL178700
Type:
Small organic molecule
Emp. Form.:
C21H25NO2
Mol. Mass.:
323.4287
SMILES:
C(C1COc2ccccc2O1)N1CCC(Cc2ccccc2)CC1
: