Target
Sigma non-opioid intracellular receptor 1
Ligand
BDBM50159006
Substrate
Meas. Tech.
ChEMBL_303294 (CHEMBL827427)
Ki
89.3±n/a nM
Citation
 Costantino, LGandolfi, FSorbi, CFranchini, SPrezzavento, OVittorio, FRonsisvalle, GLeonardi, APoggesi, EBrasili, L Synthesis and structure-activity relationships of 1-aralkyl-4-benzylpiperidine and 1-aralkyl-4-benzylpiperazine derivatives as potent sigma ligands. J Med Chem 48:266-73 (2005)  
Target
Name:
Sigma non-opioid intracellular receptor 1
Synonyms:
Aging-associated gene 8 protein SGMR1_HUMAN SIGMAR1 SR31747-binding protein Sigma 1-type opioid receptor Sigma1R | hSigmaR1
Type:
Enzyme Catalytic Domain
Mol. Mass.:
25124.85
Organism:
Homo sapiens (Human)
Description:
Q99720
Residue:
223
  
Inhibitor
Name:
BDBM50159006
Synonyms:
6-(4-Benzyl-piperidin-1-ylmethyl)-6,7,8,9-tetrahydro-benzocyclohepten-5-one | CHEMBL179697
Type:
Small organic molecule
Emp. Form.:
C24H29NO
Mol. Mass.:
347.4932
SMILES:
O=C1C(CN2CCC(Cc3ccccc3)CC2)CCCc2ccccc12
: