Target
Sigma non-opioid intracellular receptor 1
Ligand
BDBM50159026
Substrate
Meas. Tech.
ChEMBL_303294 (CHEMBL827427)
Ki
285±n/a nM
Citation
 Costantino, LGandolfi, FSorbi, CFranchini, SPrezzavento, OVittorio, FRonsisvalle, GLeonardi, APoggesi, EBrasili, L Synthesis and structure-activity relationships of 1-aralkyl-4-benzylpiperidine and 1-aralkyl-4-benzylpiperazine derivatives as potent sigma ligands. J Med Chem 48:266-73 (2005)  
Target
Name:
Sigma non-opioid intracellular receptor 1
Synonyms:
Aging-associated gene 8 protein SGMR1_HUMAN SIGMAR1 SR31747-binding protein Sigma 1-type opioid receptor Sigma1R | hSigmaR1
Type:
Enzyme Catalytic Domain
Mol. Mass.:
25124.85
Organism:
Homo sapiens (Human)
Description:
Q99720
Residue:
223
  
Inhibitor
Name:
BDBM50159026
Synonyms:
2-(4-Benzyl-piperidin-1-ylmethyl)-chromen-4-one | CHEMBL179062
Type:
Small organic molecule
Emp. Form.:
C22H23NO2
Mol. Mass.:
333.4235
SMILES:
O=c1cc(CN2CCC(Cc3ccccc3)CC2)oc2ccccc12
: