Target
5-hydroxytryptamine receptor 1A
Ligand
BDBM50159022
Substrate
Meas. Tech.
ChEMBL_303379 (CHEMBL839696)
Ki
69.4±n/a nM
Citation
 Costantino, LGandolfi, FSorbi, CFranchini, SPrezzavento, OVittorio, FRonsisvalle, GLeonardi, APoggesi, EBrasili, L Synthesis and structure-activity relationships of 1-aralkyl-4-benzylpiperidine and 1-aralkyl-4-benzylpiperazine derivatives as potent sigma ligands. J Med Chem 48:266-73 (2005)  
Target
Name:
5-hydroxytryptamine receptor 1A
Synonyms:
5-HT-1A 5-hydroxytryptamine receptor 1A (5-HT-1A) ADRB2RL1 Dopamine D2 receptor and serotonin 1a receptor HTR1A | Serotonin receptor 1A
Type:
Mol. Mass.:
46122.49
Organism:
Homo sapiens (Human)
Description:
Residue:
422
  
Inhibitor
Name:
BDBM50159022
Synonyms:
1-Benzyl-4-(2,3-dihydro-benzo[1,4]dioxin-2-ylmethyl)-piperazine | CHEMBL359663
Type:
Small organic molecule
Emp. Form.:
C20H24N2O2
Mol. Mass.:
324.4168
SMILES:
C(C1COc2ccccc2O1)N1CCN(Cc2ccccc2)CC1
: