Target
Equilibrative nucleoside transporter 1
Ligand
BDBM50370566
Substrate
Meas. Tech.
ChEMBL_303651 (CHEMBL828999)
Ki
5.4±n/a nM
Citation
 Tromp, RASpanjersberg, RFvon Frijtag Drabbe Künzel, JKIJzerman, AP Inhibition of nucleoside transport proteins by C8-alkylamine-substituted purines. J Med Chem 48:321-9 (2005)  
Target
Name:
Equilibrative nucleoside transporter 1
Synonyms:
ENT1 Equilibrative Nucleoside Transporter 1 (ENT1) Equilibrative nucleoside transporter 1 S29A1_HUMAN Solute carrier family 29 member 1
Type:
Multi-pass membrane protein
Mol. Mass.:
50225.92
Organism:
Homo sapiens (Human)
Description:
Residue:
456
  
Inhibitor
Name:
BDBM50370566
Synonyms:
CHEMBL608794
Type:
Small organic molecule
Emp. Form.:
C21H27N5O4S
Mol. Mass.:
445.535
SMILES:
CCCCNc1nc2c(SCc3ccccc3)ncnc2n1C1O[C@H](CO)[C@@H](O)[C@H]1O
: