Target
Histamine H3 receptor
Ligand
BDBM50158609
Substrate
Meas. Tech.
ChEMBL_303685 (CHEMBL828754)
Ki
0.19±n/a nM
Citation
 Cowart, MFaghih, RCurtis, MPGfesser, GABennani, YLBlack, LAPan, LMarsh, KCSullivan, JPEsbenshade, TAFox, GBHancock, AA 4-(2-[2-(2(R)-methylpyrrolidin-1-yl)ethyl]benzofuran-5-yl)benzonitrile and related 2-aminoethylbenzofuran H3 receptor antagonists potently enhance cognition and attention. J Med Chem 48:38-55 (2005)  
Target
Name:
Histamine H3 receptor
Synonyms:
G-protein coupled receptor 97 HH3R HRH3 Histamine H3 receptor (H3) Histamine receptor (H3 and H4)
Type:
G Protein-Coupled Receptor (GPCR)
Mol. Mass.:
48691.47
Organism:
Homo sapiens (Human)
Description:
Binding assays were using CHO cells stably expressing hH3R receptors.
Residue:
445
  
Inhibitor
Name:
BDBM50158609
Synonyms:
(4-Chloro-phenyl)-{2-[2-((R)-2-methyl-pyrrolidin-1-yl)-ethyl]-benzofuran-5-yl}-methanone | CHEMBL362607
Type:
Small organic molecule
Emp. Form.:
C22H22ClNO2
Mol. Mass.:
367.869
SMILES:
C[C@@H]1CCCN1CCc1cc2cc(ccc2o1)C(=O)c1ccc(Cl)cc1
: