Target
Type-2 angiotensin II receptor
Ligand
BDBM50370575
Substrate
Meas. Tech.
ChEMBL_303241 (CHEMBL827206)
Ki
0.3±n/a nM
Citation
 Rosenström, USköld, CPlouffe, BBeaudry, HLindeberg, GBotros, MNyberg, FWolf, GKarlén, AGallo-Payet, NHallberg, A New selective AT2 receptor ligands encompassing a gamma-turn mimetic replacing the amino acid residues 4-5 of angiotensin II act as agonists. J Med Chem 48:4009-24 (2005)  
Target
Name:
Type-2 angiotensin II receptor
Synonyms:
AGTR2 AT2 Angiotensin II type 2 (AT-2) receptor Type-2 angiotensin II receptor
Type:
Enzyme Catalytic Domain
Mol. Mass.:
41201.61
Organism:
Homo sapiens (Human)
Description:
Angiotensin II, central 0 0::P50052
Residue:
363
  
Inhibitor
Name:
BDBM50370575
Synonyms:
CHEMBL1791308
Type:
Small organic molecule
Emp. Form.:
C57H76N14O12
Mol. Mass.:
1149.2999
SMILES:
CC[C@@H](C)[C@H](N1Cc2cccc(NC(=O)[C@@H](NC(=O)[C@H](CCCN=C(N)N)NC(=O)[C@@H](N)CC(O)=O)C(C)C)c2N[C@@H](Cc2ccc(O)cc2)C1=O)C(=O)N[C@@H](Cc1cnc[nH]1)C(=O)N1CCC[C@H]1C(=O)N[C@@H](Cc1ccccc1)C(O)=O
: