Target
Corticotropin-releasing factor receptor 1
Ligand
BDBM50168461
Substrate
Meas. Tech.
ChEMBL_303632 (CHEMBL828842)
Ki
49±n/a nM
Citation
 Dyck, BGrigoriadis, DEGross, RSGuo, ZHaddach, MMarinkovic, DMcCarthy, JRMoorjani, MRegan, CFSaunders, JSchwaebe, MKSzabo, TWilliams, JPZhang, XBozigian, HChen, TK Potent, orally active corticotropin-releasing factor receptor-1 antagonists containing a tricyclic pyrrolopyridine or pyrazolopyridine core. J Med Chem 48:4100-10 (2005)  
Target
Name:
Corticotropin-releasing factor receptor 1
Synonyms:
CRF-R CRF1 CRFR1 CRH-R 1 CRHR1 Corticotropin-releasing factor receptor 1 (CRF-1) Corticotropin-releasing hormone receptor 1
Type:
Enzyme
Mol. Mass.:
50744.31
Organism:
Homo sapiens (Human)
Description:
P34998
Residue:
444
  
Inhibitor
Name:
BDBM50168461
Synonyms:
2-(5-Butyl-7-methyl-4,5-dihydro-3H-1,5,8-triaza-acenaphthylen-1-yl)-5-chloro-benzonitrile | CHEMBL371367
Type:
Small organic molecule
Emp. Form.:
C21H21ClN4
Mol. Mass.:
364.871
SMILES:
CCCCN1CCc2cn(-c3ccc(Cl)cc3C#N)c3nc(C)cc1c23
: