Target
Mitogen-activated protein kinase 10
Ligand
BDBM50169995
Substrate
Meas. Tech.
ChEMBL_304976 (CHEMBL829309)
IC50
3080±n/a nM
Citation
 Gaillard, PJeanclaude-Etter, IArdissone, VArkinstall, SCambet, YCamps, MChabert, CChurch, DCirillo, RGretener, DHalazy, SNichols, ASzyndralewiez, CVitte, PAGotteland, JP Design and synthesis of the first generation of novel potent, selective, and in vivo active (benzothiazol-2-yl)acetonitrile inhibitors of the c-Jun N-terminal kinase. J Med Chem 48:4596-607 (2005)  
Target
Name:
Mitogen-activated protein kinase 10
Synonyms:
Jnk3 Mapk10 c-Jun N-terminal kinase 3
Type:
PROTEIN
Mol. Mass.:
52534.34
Organism:
Rattus norvegicus
Description:
ChEMBL_1460661
Residue:
464
  
Inhibitor
Name:
BDBM50169995
Synonyms:
2-(2-(4-methoxyphenethylamino)pyrimidin-4-yl)-2-(benzo[d]thiazol-2(3H)-ylidene)acetonitrile [3H-Benzothiazol-(2Z)-ylidene]-{2-[2-(4-methoxy-phenyl)-ethylamino]-pyrimidin-4-yl}-acetonitrile
Type:
Small organic molecule
Emp. Form.:
C22H19N5OS
Mol. Mass.:
401.484
SMILES:
COc1ccc(CCNc2nccc(n2)C(C#N)c2nc3ccccc3s2)cc1
: