Target
Mitogen-activated protein kinase 10
Ligand
BDBM50170004
Substrate
Meas. Tech.
ChEMBL_304976 (CHEMBL829309)
IC50
7200±n/a nM
Citation
 Gaillard, PJeanclaude-Etter, IArdissone, VArkinstall, SCambet, YCamps, MChabert, CChurch, DCirillo, RGretener, DHalazy, SNichols, ASzyndralewiez, CVitte, PAGotteland, JP Design and synthesis of the first generation of novel potent, selective, and in vivo active (benzothiazol-2-yl)acetonitrile inhibitors of the c-Jun N-terminal kinase. J Med Chem 48:4596-607 (2005)  
Target
Name:
Mitogen-activated protein kinase 10
Synonyms:
Jnk3 Mapk10 c-Jun N-terminal kinase 3
Type:
PROTEIN
Mol. Mass.:
52534.34
Organism:
Rattus norvegicus
Description:
ChEMBL_1460661
Residue:
464
  
Inhibitor
Name:
BDBM50170004
Synonyms:
CHEMBL191536 | [3H-Benzothiazol-(2Z)-ylidene]-[2-(4-methoxy-piperidin-1-yl)-pyrimidin-4-yl]-acetonitrile
Type:
Small organic molecule
Emp. Form.:
C19H19N5OS
Mol. Mass.:
365.452
SMILES:
COC1CCN(CC1)c1nccc(n1)C(C#N)c1nc2ccccc2s1
: