Target
S-methyl-5'-thioadenosine phosphorylase
Ligand
BDBM50170094
Substrate
Meas. Tech.
ChEMBL_303908 (CHEMBL828333)
Ki
0.37±n/a nM
Citation
 Evans, GBFurneaux, RHLenz, DHPainter, GFSchramm, VLSingh, VTyler, PC Second generation transition state analogue inhibitors of human 5'-methylthioadenosine phosphorylase. J Med Chem 48:4679-89 (2005)  
Target
Name:
S-methyl-5'-thioadenosine phosphorylase
Synonyms:
5'-Methylthioadenosine phosphorylase (MTAP) MTA phosphorylase MTAP_HUMAN Methylthioadenosine Phosphorylase (MTAP) | S-methyl-5 -thioadenosine phosphorylase
Type:
Enzyme
Mol. Mass.:
31239.23
Organism:
Homo sapiens (Human)
Description:
Residue:
283
  
Inhibitor
Name:
BDBM50170094
Synonyms:
1-(4-Amino-4,5-dihydro-3H-pyrrolo[3,2-d]pyrimidin-7-ylmethyl)-4-cyclohexylsulfanylmethyl-pyrrolidin-3-ol | CHEMBL190867
Type:
Small organic molecule
Emp. Form.:
C18H29N5OS
Mol. Mass.:
363.521
SMILES:
NC1NC=Nc2c(CN3CC(O)C(CSC4CCCCC4)C3)c[nH]c12
: