Target
Neuronal acetylcholine receptor; alpha2/beta4
Ligand
BDBM50170586
Substrate
Meas. Tech.
ChEMBL_306297 (CHEMBL828589)
IC50
0.75±n/a nM
Citation
 Jensen, AAFrølund, BLiljefors, TKrogsgaard-Larsen, P Neuronal nicotinic acetylcholine receptors: structural revelations, target identifications, and therapeutic inspirations. J Med Chem 48:4705-45 (2005)  
Target
Name:
Neuronal acetylcholine receptor; alpha2/beta4
Synonyms:
Neuronal acetylcholine receptor protein alpha-2 subunit/subunit beta-4 | Neuronal acetylcholine receptor subunit alpha-2/beta-4
Type:
Mol. Mass.:
Description:
ASSAY_ID of ChEMBL is 2150172
Components:
This complex has 2 components.
Component 1
Name:
Neuronal acetylcholine receptor subunit beta-4
Synonyms:
ACHB4_HUMAN Cholinergic, Nicotinic Alpha6Beta3Beta4Alpha5 Nicotinic acetylcholine receptor alpha6/alpha3/beta4
Type:
Enzyme Catalytic Domain
Mol. Mass.:
56388.51
Organism:
Homo sapiens (Human)
Description:
Cholinergic, Nicotinic Alpha6Beta3Beta4Alpha5 0 HUMAN::P30926
Residue:
498
  
Component 2
Name:
Neuronal acetylcholine receptor subunit alpha-2
Synonyms:
ACHA2_HUMAN Neuronal acetylcholine receptor; alpha2/beta2
Type:
Enzyme Catalytic Domain
Mol. Mass.:
59759.69
Organism:
Homo sapiens (Human)
Description:
Cholinergic, Nicotinic Alpha2Beta2 0 HUMAN::Q15822
Residue:
529
  
Inhibitor
Name:
BDBM50170586
Synonyms:
(3S)-3-{[(2S)-1-[(2S)-2-[(2S,3R)-2-[(2S)-2-[(2S)-2-[(2R)-2-{[(2S)-1-{[(2S)-1-[(2S)-2-[(2S)-2-[(2R)-2-[(2R)-2-(2-aminoacetamido)-3-sulfanylpropanamido]-3-sulfanylpropanamido]-3-hydroxypropanamido]-3-(4-hydroxyphenyl)propanoyl]pyrrolidin-2-yl]carbonyl}pyrrolidin-2-yl]formamido}-3-sulfanylpropanamido]-3-phenylpropanamido]propanamido]-3-hydroxybutanamido]-3-carbamoylpropanoyl]pyrrolidin-2-yl]formamido}-3-{[(2R)-1-oxo-3-sulfanylpropan-2-yl]carbamoyl}propanoic acid | CHEMBL429557
Type:
Small organic molecule
Emp. Form.:
C65H92N16O21S4
Mol. Mass.:
1561.781
SMILES:
C[C@@H](O)[C@H](NC(=O)[C@H](C)NC(=O)[C@H](Cc1ccccc1)NC(=O)[C@H](CS)NC(=O)[C@@H]1CCCN1C(=O)[C@@H]1CCCN1C(=O)[C@H](Cc1ccc(O)cc1)NC(=O)[C@H](CO)NC(=O)[C@H](CS)NC(=O)[C@H](CS)NC(=O)CN)C(=O)N[C@@H](CC(N)=O)C(=O)N1CCC[C@H]1C(=O)N[C@@H](CC(O)=O)C(=O)N[C@@H](CS)C=O
: