Target
Neuronal acetylcholine receptor subunit alpha-3/beta-2
Ligand
BDBM50369323
Substrate
Meas. Tech.
ChEMBL_305726 (CHEMBL829398)
IC50
280±n/a nM
Citation
 Jensen, AAFrølund, BLiljefors, TKrogsgaard-Larsen, P Neuronal nicotinic acetylcholine receptors: structural revelations, target identifications, and therapeutic inspirations. J Med Chem 48:4705-45 (2005)  
Target
Name:
Neuronal acetylcholine receptor subunit alpha-3/beta-2
Synonyms:
Neuronal acetylcholine receptor protein alpha-3/beta-2 subunit Neuronal acetylcholine receptor; alpha3/beta2
Type:
Mol. Mass.:
Description:
ASSAY_ID of EBI is 143246
Components:
This complex has 2 components.
Component 1
Name:
Neuronal acetylcholine receptor subunit beta-2
Synonyms:
ACHB2_HUMAN Neuronal acetylcholine receptor protein beta-2 subunit | Nicotinic acetylcholine receptor alpha3/beta2/alpha5
Type:
Protein
Mol. Mass.:
57020.50
Organism:
Homo sapiens (Human)
Description:
P17787
Residue:
502
  
Component 2
Name:
Neuronal acetylcholine receptor subunit alpha-3
Synonyms:
ACHA3_HUMAN Cholinergic, Nicotinic Alpha3Beta2 Cholinergic, Nicotinic Alpha3Beta4x NACHRA3 Neuronal acetylcholine receptor subunit alpha-3 nicotinic central
Type:
Enzyme Catalytic Domain
Mol. Mass.:
57479.03
Organism:
Homo sapiens (Human)
Description:
Cholinergic, Nicotinic Alpha3Beta2 0 HUMAN::P32297
Residue:
505
  
Inhibitor
Name:
BDBM50369323
Synonyms:
MECAMYLAMINE
Type:
Small organic molecule
Emp. Form.:
C11H21N
Mol. Mass.:
167.2911
SMILES:
CN[C@]1(C)[C@@H]2CC[C@@H](C2)C1(C)C
: