Target
Neuronal acetylcholine receptor subunit alpha-7
Ligand
BDBM50170603
Substrate
Meas. Tech.
ChEMBL_305538 (CHEMBL828558)
IC50
61±n/a nM
Citation
 Jensen, AAFrølund, BLiljefors, TKrogsgaard-Larsen, P Neuronal nicotinic acetylcholine receptors: structural revelations, target identifications, and therapeutic inspirations. J Med Chem 48:4705-45 (2005)  
Target
Name:
Neuronal acetylcholine receptor subunit alpha-7
Synonyms:
ACHA7_HUMAN Cholinergic, Nicotinic Alpha7 Neuronal acetylcholine receptor protein alpha-7 subunit Nicotinic acetylcholine receptor alpha-7 (alpha7 nAChR)
Type:
Mol. Mass.:
56448.33
Organism:
Homo sapiens (Human)
Description:
CHRNA7 (NACHRA7)
Residue:
502
  
Inhibitor
Name:
BDBM50170603
Synonyms:
(3S)-3-{[(2S)-1-[(2S)-2-[(2S)-2-[(2S)-2-[(2S)-2-[(2R)-2-{[(2S)-1-{[(2S)-1-[(2S)-2-[(2S)-2-[(2R)-2-[(2R)-2-(2-aminoacetamido)-3-sulfanylpropanamido]-3-sulfanylpropanamido]-3-hydroxypropanamido]-4-methylpentanoyl]pyrrolidin-2-yl]carbonyl}pyrrolidin-2-yl]formamido}-3-sulfanylpropanamido]propanamido]-4-methylpentanamido]-3-hydroxypropanamido]-3-carbamoylpropanoyl]pyrrolidin-2-yl]formamido}-3-{[(1S)-1-{[(1R)-1-carbamoyl-2-sulfanylethyl]carbamoyl}-2-(4-hydroxyphenyl)ethyl]carbamoyl}propanoic acid | CHEMBL411736
Type:
Small organic molecule
Emp. Form.:
C67H104N18O22S4
Mol. Mass.:
1641.91
SMILES:
CC(C)C[C@H](NC(=O)[C@H](C)NC(=O)[C@H](CS)NC(=O)[C@@H]1CCCN1C(=O)[C@@H]1CCCN1C(=O)[C@H](CC(C)C)NC(=O)[C@H](CO)NC(=O)[C@H](CS)NC(=O)[C@H](CS)NC(=O)CN)C(=O)N[C@@H](CO)C(=O)N[C@@H](CC(N)=O)C(=O)N1CCC[C@H]1C(=O)N[C@@H](CC(O)=O)C(=O)N[C@@H](Cc1ccc(O)cc1)C(=O)N[C@@H](CS)C(N)=O
: