Target
Neuronal acetylcholine receptor; alpha2/beta4
Ligand
BDBM50369323
Substrate
Meas. Tech.
ChEMBL_305725 (CHEMBL829397)
IC50
16000±n/a nM
Citation
 Jensen, AAFrølund, BLiljefors, TKrogsgaard-Larsen, P Neuronal nicotinic acetylcholine receptors: structural revelations, target identifications, and therapeutic inspirations. J Med Chem 48:4705-45 (2005)  
Target
Name:
Neuronal acetylcholine receptor; alpha2/beta4
Synonyms:
Neuronal acetylcholine receptor protein alpha-2 subunit/subunit beta-4 | Neuronal acetylcholine receptor subunit alpha-2/beta-4
Type:
Mol. Mass.:
Description:
ASSAY_ID of ChEMBL is 2150172
Components:
This complex has 2 components.
Component 1
Name:
Neuronal acetylcholine receptor subunit beta-4
Synonyms:
ACHB4_HUMAN Cholinergic, Nicotinic Alpha6Beta3Beta4Alpha5 Nicotinic acetylcholine receptor alpha6/alpha3/beta4
Type:
Enzyme Catalytic Domain
Mol. Mass.:
56388.51
Organism:
Homo sapiens (Human)
Description:
Cholinergic, Nicotinic Alpha6Beta3Beta4Alpha5 0 HUMAN::P30926
Residue:
498
  
Component 2
Name:
Neuronal acetylcholine receptor subunit alpha-2
Synonyms:
ACHA2_HUMAN Neuronal acetylcholine receptor; alpha2/beta2
Type:
Enzyme Catalytic Domain
Mol. Mass.:
59759.69
Organism:
Homo sapiens (Human)
Description:
Cholinergic, Nicotinic Alpha2Beta2 0 HUMAN::Q15822
Residue:
529
  
Inhibitor
Name:
BDBM50369323
Synonyms:
MECAMYLAMINE
Type:
Small organic molecule
Emp. Form.:
C11H21N
Mol. Mass.:
167.2911
SMILES:
CN[C@]1(C)[C@@H]2CC[C@@H](C2)C1(C)C
: