Target
Sigma non-opioid intracellular receptor 1
Ligand
BDBM50170646
Substrate
Meas. Tech.
ChEMBL_303441 (CHEMBL839610)
Ki
680±n/a nM
Citation
 Laggner, CSchieferer, CFiechtner, BPoles, GHoffmann, RDGlossmann, HLanger, TMoebius, FF Discovery of high-affinity ligands of sigma1 receptor, ERG2, and emopamil binding protein by pharmacophore modeling and virtual screening. J Med Chem 48:4754-64 (2005)  
Target
Name:
Sigma non-opioid intracellular receptor 1
Synonyms:
Aging-associated gene 8 protein SGMR1_HUMAN SIGMAR1 SR31747-binding protein Sigma 1-type opioid receptor Sigma1R | hSigmaR1
Type:
Enzyme Catalytic Domain
Mol. Mass.:
25124.85
Organism:
Homo sapiens (Human)
Description:
Q99720
Residue:
223
  
Inhibitor
Name:
BDBM50170646
Synonyms:
4-(2-{4-[(E)-3-(4-Chloro-phenyl)-allyl]-piperazin-1-yl}-ethyl)-benzoic acid CHEMBL2172263
Type:
Small organic molecule
Emp. Form.:
C22H25ClN2O2
Mol. Mass.:
384.899
SMILES:
OC(=O)c1ccc(CCN2CCN(C\C=C\c3ccc(Cl)cc3)CC2)cc1
: