Target
C-8 sterol isomerase ERG2
Ligand
BDBM50170641
Substrate
Meas. Tech.
ChEMBL_303390 (CHEMBL839961)
Ki
9±n/a nM
Citation
 Laggner, CSchieferer, CFiechtner, BPoles, GHoffmann, RDGlossmann, HLanger, TMoebius, FF Discovery of high-affinity ligands of sigma1 receptor, ERG2, and emopamil binding protein by pharmacophore modeling and virtual screening. J Med Chem 48:4754-64 (2005)  
Target
Name:
C-8 sterol isomerase ERG2
Synonyms:
C-8 sterol isomerase ERG2 | ERG2_YEAST
Type:
PROTEIN
Mol. Mass.:
24892.29
Organism:
Saccharomyces cerevisiae
Description:
ChEMBL_303390
Residue:
222
  
Inhibitor
Name:
BDBM50170641
Synonyms:
CHEMBL188476 | [(E)-3-(3-Chloro-4-cyclohexyl-phenyl)-allyl]-cyclohexyl-ethyl-amine
Type:
Small organic molecule
Emp. Form.:
C23H34ClN
Mol. Mass.:
359.976
SMILES:
CCN(C\C=C\c1ccc(C2CCCCC2)c(Cl)c1)C1CCCCC1
: