Target
C-8 sterol isomerase ERG2
Ligand
BDBM50170639
Substrate
Meas. Tech.
ChEMBL_303390 (CHEMBL839961)
Ki
169±n/a nM
Citation
 Laggner, CSchieferer, CFiechtner, BPoles, GHoffmann, RDGlossmann, HLanger, TMoebius, FF Discovery of high-affinity ligands of sigma1 receptor, ERG2, and emopamil binding protein by pharmacophore modeling and virtual screening. J Med Chem 48:4754-64 (2005)  
Target
Name:
C-8 sterol isomerase ERG2
Synonyms:
C-8 sterol isomerase ERG2 | ERG2_YEAST
Type:
PROTEIN
Mol. Mass.:
24892.29
Organism:
Saccharomyces cerevisiae
Description:
ChEMBL_303390
Residue:
222
  
Inhibitor
Name:
BDBM50170639
Synonyms:
Benzothiazol-2-yl-methyl-[1-(4-phenoxy-butyl)-pyrrolidin-3-yl]-amine | CHEMBL363765
Type:
Small organic molecule
Emp. Form.:
C22H27N3OS
Mol. Mass.:
381.534
SMILES:
CN(C1CCN(CCCCOc2ccccc2)C1)c1nc2ccccc2s1
: