Target
C-8 sterol isomerase ERG2
Ligand
BDBM18957
Substrate
Meas. Tech.
ChEMBL_303390 (CHEMBL839961)
Ki
62±n/a nM
Citation
 Laggner, CSchieferer, CFiechtner, BPoles, GHoffmann, RDGlossmann, HLanger, TMoebius, FF Discovery of high-affinity ligands of sigma1 receptor, ERG2, and emopamil binding protein by pharmacophore modeling and virtual screening. J Med Chem 48:4754-64 (2005)  
Target
Name:
C-8 sterol isomerase ERG2
Synonyms:
C-8 sterol isomerase ERG2 | ERG2_YEAST
Type:
PROTEIN
Mol. Mass.:
24892.29
Organism:
Saccharomyces cerevisiae
Description:
ChEMBL_303390
Residue:
222
  
Inhibitor
Name:
BDBM18957
Synonyms:
(2-{4-[(2-butyl-1-benzofuran-3-yl)carbonyl]-2,6-diiodophenoxy}ethyl)diethylamine Amiodarone Cordarone cid_441325
Type:
Small organic molecule
Emp. Form.:
C25H29I2NO3
Mol. Mass.:
645.3116
SMILES:
CCCCc1oc2ccccc2c1C(=O)c1cc(I)c(OCCN(CC)CC)c(I)c1
: