Target
C-8 sterol isomerase ERG2
Ligand
BDBM50170663
Substrate
Meas. Tech.
ChEMBL_303390 (CHEMBL839961)
Ki
1000±n/a nM
Citation
 Laggner, CSchieferer, CFiechtner, BPoles, GHoffmann, RDGlossmann, HLanger, TMoebius, FF Discovery of high-affinity ligands of sigma1 receptor, ERG2, and emopamil binding protein by pharmacophore modeling and virtual screening. J Med Chem 48:4754-64 (2005)  
Target
Name:
C-8 sterol isomerase ERG2
Synonyms:
C-8 sterol isomerase ERG2 | ERG2_YEAST
Type:
PROTEIN
Mol. Mass.:
24892.29
Organism:
Saccharomyces cerevisiae
Description:
ChEMBL_303390
Residue:
222
  
Inhibitor
Name:
BDBM50170663
Synonyms:
(7S,8R)-7,8-Dimethyl-6-(3-methyl-but-2-enylamino)-8-propyl-5,6,7,8-tetrahydro-naphthalen-2-ol | CHEMBL305593
Type:
Small organic molecule
Emp. Form.:
C19H27NO
Mol. Mass.:
285.4238
SMILES:
[H][C@@]1([#6])[#6]-2-[#6]-c3ccc(-[#8])cc3[C@]1([#6])[#6]-[#6]-[#7]-2-[#6]\[#6]=[#6](\[#6])-[#6]
: