Target
5-hydroxytryptamine receptor 6
Ligand
BDBM50159184
Substrate
Meas. Tech.
ChEMBL_310551 (CHEMBL834452)
EC50
5.8±n/a nM
Citation
 Cole, DCLennox, WJLombardi, SEllingboe, JWBernotas, RCTawa, GJMazandarani, HSmith, DLZhang, GCoupet, JSchechter, LE Discovery of 5-arylsulfonamido-3-(pyrrolidin-2-ylmethyl)-1H-indole derivatives as potent, selective 5-HT6 receptor agonists and antagonists. J Med Chem 48:353-6 (2005)  
Target
Name:
5-hydroxytryptamine receptor 6
Synonyms:
5-HT-6 5-hydroxytryptamine receptor 6 (5-HT-6) 5-hydroxytryptamine receptor 6 (5HT6) HTR6 Serotonin 6 (5-HT6) receptor | Serotonin Receptor 6
Type:
G Protein-Coupled Receptor (GPCR)
Mol. Mass.:
46968.43
Organism:
Homo sapiens (Human)
Description:
P50406
Residue:
440
  
Inhibitor
Name:
BDBM50159184
Synonyms:
N-(3-(R)-1-Pyrrolidin-2-ylmethyl-1H-indol-5-yl)-3-trifluoromethyl-benzenesulfonamide
Type:
Small organic molecule
Emp. Form.:
C20H20F3N3O2S
Mol. Mass.:
423.452
SMILES:
FC(F)(F)c1cccc(c1)S(=O)(=O)Nc1ccc2[nH]cc(CC3CCCN3)c2c1
: