Target
Cytochrome P450 2A5
Ligand
BDBM50159245
Substrate
Meas. Tech.
ChEMBL_305268 (CHEMBL832818)
IC50
2200±n/a nM
Citation
 Rahnasto, MRaunio, HPoso, AWittekindt, CJuvonen, RO Quantitative structure-activity relationship analysis of inhibitors of the nicotine metabolizing CYP2A6 enzyme. J Med Chem 48:440-9 (2005)  
Target
Name:
Cytochrome P450 2A5
Synonyms:
CP2A5_MOUSE Cyp2a5
Type:
PROTEIN
Mol. Mass.:
56752.73
Organism:
Mus musculus
Description:
ChEMBL_572014
Residue:
494
  
Inhibitor
Name:
BDBM50159245
Synonyms:
1,4-dibromobenzene p-bromophenyl bromide | p-dibromobenzene
Type:
Small organic molecule
Emp. Form.:
C6H4Br2
Mol. Mass.:
235.904
SMILES:
Brc1ccc(Br)cc1
: