Target
Primary amine oxidase
Ligand
BDBM50161140
Substrate
Meas. Tech.
ChEMBL_306391 (CHEMBL828732)
IC50
89000±n/a nM
Citation
 Bertini, VBuffoni, FIgnesti, GPicci, NTrombino, SIemma, FAlfei, SPocci, MLucchesini, FDe Munno, A Alkylamino derivatives of 4-aminomethylpyridine as inhibitors of copper-containing amine oxidases. J Med Chem 48:664-70 (2005)  
Target
Name:
Primary amine oxidase
Synonyms:
AMO_PEA | Amine oxidase
Type:
PROTEIN
Mol. Mass.:
76360.57
Organism:
Pisum sativum
Description:
ChEMBL_306391
Residue:
674
  
Inhibitor
Name:
BDBM50161140
Synonyms:
4-(aminomethyl)-N-(cyclohexylmethyl)pyridin-3-amine dihydrochloride hydrate | CHEMBL541126
Type:
Small organic molecule
Emp. Form.:
C13H21N3
Mol. Mass.:
219.3259
SMILES:
NCc1ccncc1NCC1CCCCC1
: