Target
Amiloride-sensitive amine oxidase [copper-containing]
Ligand
BDBM50370601
Substrate
Meas. Tech.
ChEMBL_306517 (CHEMBL828122)
IC50
>1000000±n/a nM
Citation
 Bertini, VBuffoni, FIgnesti, GPicci, NTrombino, SIemma, FAlfei, SPocci, MLucchesini, FDe Munno, A Alkylamino derivatives of 4-aminomethylpyridine as inhibitors of copper-containing amine oxidases. J Med Chem 48:664-70 (2005)  
Target
Name:
Amiloride-sensitive amine oxidase [copper-containing]
Synonyms:
ABP AOC1 Amiloride-binding protein DAO1 Diamine oxidase (DAO) KAO | Kidney amine oxidase
Type:
Protein
Mol. Mass.:
85387.64
Organism:
Homo sapiens (Human)
Description:
P19801
Residue:
751
  
Inhibitor
Name:
BDBM50370601
Synonyms:
CHEMBL539362
Type:
Small organic molecule
Emp. Form.:
C14H24N2S2
Mol. Mass.:
284.484
SMILES:
CC(C)(C)Sc1cncc(SC(C)(C)C)c1CN
: