Target
Amiloride-sensitive amine oxidase [copper-containing]
Ligand
BDBM50161132
Substrate
Meas. Tech.
ChEMBL_306517 (CHEMBL828122)
IC50
500±n/a nM
Citation
 Bertini, VBuffoni, FIgnesti, GPicci, NTrombino, SIemma, FAlfei, SPocci, MLucchesini, FDe Munno, A Alkylamino derivatives of 4-aminomethylpyridine as inhibitors of copper-containing amine oxidases. J Med Chem 48:664-70 (2005)  
Target
Name:
Amiloride-sensitive amine oxidase [copper-containing]
Synonyms:
ABP AOC1 Amiloride-binding protein DAO1 Diamine oxidase (DAO) KAO | Kidney amine oxidase
Type:
Protein
Mol. Mass.:
85387.64
Organism:
Homo sapiens (Human)
Description:
P19801
Residue:
751
  
Inhibitor
Name:
BDBM50161132
Synonyms:
4-(aminomethyl)-N-ethylpyridin-3-amine dihydrochloride | CHEMBL537624
Type:
Small organic molecule
Emp. Form.:
C8H13N3
Mol. Mass.:
151.2089
SMILES:
CCNc1cnccc1CN
: