Target
Epidermal growth factor receptor
Ligand
BDBM50161880
Substrate
Meas. Tech.
ChEMBL_312997 (CHEMBL873338)
IC50
23±n/a nM
Citation
 Tsou, HROverbeek-Klumpers, EGHallett, WAReich, MFFloyd, MBJohnson, BDMichalak, RSNilakantan, RDiscafani, CGolas, JRabindran, SKShen, RShi, XWang, YFUpeslacis, JWissner, A Optimization of 6,7-disubstituted-4-(arylamino)quinoline-3-carbonitriles as orally active, irreversible inhibitors of human epidermal growth factor receptor-2 kinase activity. J Med Chem 48:1107-31 (2005)  
Target
Name:
Epidermal growth factor receptor
Synonyms:
EGF Receptor Substrate EGFR_HUMAN ERBB1 Epidermal Growth Factor Receptor erbB-1 Epidermal growth factor receptor (EGFR) HER1 Proto-oncogene c-ErbB-1 Tyrosine-Protein Kinase ErbB-1
Type:
Receptor Kinase Domain
Mol. Mass.:
134279.59
Organism:
Homo sapiens (Human)
Description:
P00533
Residue:
1210
  
Inhibitor
Name:
BDBM50161880
Synonyms:
4-Dimethylamino-but-2-enoic acid {4-[3-chloro-4-(furan-2-ylmethoxy)-phenylamino]-3-cyano-7-ethoxy-quinolin-6-yl}-amide | CHEMBL176199
Type:
Small organic molecule
Emp. Form.:
C29H28ClN5O4
Mol. Mass.:
546.017
SMILES:
CCOc1cc2ncc(C#N)c(Nc3ccc(OCc4ccco4)c(Cl)c3)c2cc1NC(=O)\C=C\CN(C)C
: