Target
Cholinesterase
Ligand
BDBM10610
Substrate
Meas. Tech.
ChEMBL_305654 (CHEMBL829512)
IC50
4±n/a nM
Citation
 Luo, WYu, QSZhan, MParrish, DDeschamps, JRKulkarni, SSHolloway, HWAlley, GMLahiri, DKBrossi, AGreig, NH Novel anticholinesterases based on the molecular skeletons of furobenzofuran and methanobenzodioxepine. J Med Chem 48:986-94 (2005)  
Target
Name:
Cholinesterase
Synonyms:
Acylcholine acylhydrolase Butyrylcholine esterase (BChE) Butyrylcholinesterase (BuChE) CHLE_HUMAN Cholinesterases Pseudocholinesterase
Type:
Homotetramer
Mol. Mass.:
68422.27
Organism:
Homo sapiens (Human)
Description:
P06276
Residue:
602
  
Inhibitor
Name:
BDBM10610
Synonyms:
(3aS)-1,3a,8-trimethyl-1H,2H,3H,3aH,8H,8aH-pyrrolo[2,3-b]indol-5-yl N-ethylcarbamate Physostigmine Carbamate 16a
Type:
Small organic molecule
Emp. Form.:
C16H23N3O2
Mol. Mass.:
289.3727
SMILES:
CCNC(=O)Oc1ccc2N(C)C3N(C)CC[C@@]3(C)c2c1
: