Target
Adenosine receptor A1
Ligand
BDBM50162482
Substrate
Meas. Tech.
ChEMBL_302931 (CHEMBL830390)
Ki
0.8±n/a nM
Citation
 Cappellacci, LFranchetti, PPasqualini, MPetrelli, RVita, PLavecchia, ANovellino, ECosta, BMartini, CKlotz, KNGrifantini, M Synthesis, biological evaluation, and molecular modeling of ribose-modified adenosine analogues as adenosine receptor agonists. J Med Chem 48:1550-62 (2005)  
Target
Name:
Adenosine receptor A1
Synonyms:
A1 adenosine receptor (hA1) AA1R_HUMAN ADORA1 Adenosine A1-receptor Adenosine receptor A1 (hA1) | Adenosine transporter (AdT)
Type:
G Protein-Coupled Receptor (GPCR)
Mol. Mass.:
36520.92
Organism:
Homo sapiens (Human)
Description:
P30542
Residue:
326
  
Inhibitor
Name:
BDBM50162482
Synonyms:
5-(2-Chloro-6-cyclopentylamino-purin-9-yl)-tetrahydro-furan-2,3,4-triol | CHEMBL363807
Type:
Small organic molecule
Emp. Form.:
C14H18ClN5O4
Mol. Mass.:
355.777
SMILES:
O[C@H]1O[C@H]([C@H](O)[C@@H]1O)n1cnc2c(NC3CCCC3)nc(Cl)nc12
: