Target
Alpha-galactosidase A
Ligand
BDBM50163439
Substrate
Meas. Tech.
ChEBML_305031
IC50
45000±n/a nM
Citation
 Kato, AKato, NKano, EAdachi, IIkeda, KYu, LOkamoto, TBanba, YOuchi, HTakahata, HAsano, N Biological properties of D- and L-1-deoxyazasugars. J Med Chem 48:2036-44 (2005)  
Target
Name:
Alpha-galactosidase A
Synonyms:
AGAL_HUMAN Alpha-D-galactoside galactohydrolase Alpha-glucosidase A (α-Gal A) INN=Agalsidase | Melibiase
Type:
Protein
Mol. Mass.:
48760.21
Organism:
Homo sapiens (Human)
Description:
Residue:
429
  
Inhibitor
Name:
BDBM50163439
Synonyms:
(2S,3R,4S,5R)-2-Hydroxymethyl-piperidine-3,4,5-triol | CHEMBL176021
Type:
Small organic molecule
Emp. Form.:
C6H13NO4
Mol. Mass.:
163.1717
SMILES:
OC[C@@H]1NC[C@@H](O)[C@H](O)[C@@H]1O
: