Target
cGMP-specific 3',5'-cyclic phosphodiesterase
Ligand
BDBM50163567
Substrate
Meas. Tech.
ChEMBL_306150 (CHEMBL832338)
IC50
1.75±n/a nM
Citation
 Jiang, WGuan, JMacielag, MJZhang, SQiu, YKraft, PBhattacharjee, SJohn, TMHaynes-Johnson, DLundeen, SSui, Z Pyrroloquinolone PDE5 inhibitors with improved pharmaceutical profiles for clinical studies on erectile dysfunction. J Med Chem 48:2126-33 (2005)  
Target
Name:
cGMP-specific 3',5'-cyclic phosphodiesterase
Synonyms:
PDE5A_RAT Pde5a | Phosphodiesterase 5A
Type:
PROTEIN
Mol. Mass.:
94547.60
Organism:
Rattus norvegicus
Description:
ChEMBL_155367
Residue:
833
  
Inhibitor
Name:
BDBM50163567
Synonyms:
3-Benzo[1,3]dioxol-5-yl-2-(4-imidazol-1-yl-phenyl)-1,2,3,4-tetrahydro-pyrrolo[3,4-b]quinolin-9-one | CHEMBL177348
Type:
Small organic molecule
Emp. Form.:
C27H20N4O3
Mol. Mass.:
448.4727
SMILES:
Oc1c2CN(C(c2nc2ccccc12)c1ccc2OCOc2c1)c1ccc(cc1)-n1ccnc1
: