Target
cGMP-specific 3',5'-cyclic phosphodiesterase
Ligand
BDBM50118255
Substrate
Meas. Tech.
ChEMBL_303177 (CHEMBL829671)
Ki
0.52±n/a nM
Citation
 Jiang, WGuan, JMacielag, MJZhang, SQiu, YKraft, PBhattacharjee, SJohn, TMHaynes-Johnson, DLundeen, SSui, Z Pyrroloquinolone PDE5 inhibitors with improved pharmaceutical profiles for clinical studies on erectile dysfunction. J Med Chem 48:2126-33 (2005)  
Target
Name:
cGMP-specific 3',5'-cyclic phosphodiesterase
Synonyms:
PDE5A_RAT Pde5a | Phosphodiesterase 5A
Type:
PROTEIN
Mol. Mass.:
94547.60
Organism:
Rattus norvegicus
Description:
ChEMBL_155367
Residue:
833
  
Inhibitor
Name:
BDBM50118255
Synonyms:
3-(2,3-Dihydro-benzofuran-5-yl)-2-[5-(4-methoxy-phenyl)-pyrimidin-2-yl]-1,2,3,4-tetrahydro-pyrrolo[3,4-b]quinolin-9-on CHEMBL130811
Type:
Small organic molecule
Emp. Form.:
C30H24N4O3
Mol. Mass.:
488.5366
SMILES:
COc1ccc(cc1)-c1cnc(nc1)N1Cc2c(nc3ccccc3c2O)C1c1ccc2OCCc2c1
: