Target
cGMP-specific 3',5'-cyclic phosphodiesterase
Ligand
BDBM50163582
Substrate
Meas. Tech.
ChEMBL_303177 (CHEMBL829671)
Ki
6.430±n/a nM
Citation
 Jiang, WGuan, JMacielag, MJZhang, SQiu, YKraft, PBhattacharjee, SJohn, TMHaynes-Johnson, DLundeen, SSui, Z Pyrroloquinolone PDE5 inhibitors with improved pharmaceutical profiles for clinical studies on erectile dysfunction. J Med Chem 48:2126-33 (2005)  
Target
Name:
cGMP-specific 3',5'-cyclic phosphodiesterase
Synonyms:
PDE5A_RAT Pde5a | Phosphodiesterase 5A
Type:
PROTEIN
Mol. Mass.:
94547.60
Organism:
Rattus norvegicus
Description:
ChEMBL_155367
Residue:
833
  
Inhibitor
Name:
BDBM50163582
Synonyms:
2-[2,2'']Bipyridinyl-5-yl-3-(2,3-dihydro-benzofuran-5-yl)-1,2,3,4-tetrahydro-pyrrolo[3,4-b]quinolin-9-one | CHEMBL369259
Type:
Small organic molecule
Emp. Form.:
C29H22N4O2
Mol. Mass.:
458.5106
SMILES:
Oc1c2CN(C(c2nc2ccccc12)c1ccc2OCCc2c1)c1ccc(nc1)-c1ccccn1
: