Target
Metabotropic glutamate receptor 1
Ligand
BDBM50163623
Substrate
Meas. Tech.
ChEMBL_305883 (CHEMBL874546)
IC50
9±n/a nM
Citation
 Mabire, DCoupa, SAdelinet, CPoncelet, ASimonnet, YVenet, MWouters, RLesage, ASVan Beijsterveldt, LBischoff, F Synthesis, structure-activity relationship, and receptor pharmacology of a new series of quinoline derivatives acting as selective, noncompetitive mGlu1 antagonists. J Med Chem 48:2134-53 (2005)  
Target
Name:
Metabotropic glutamate receptor 1
Synonyms:
GPRC1A GRM1_HUMAN Metabotropic Glutamate 1a | metabotropic glutamate 1
Type:
Enzyme
Mol. Mass.:
132358.19
Organism:
Homo sapiens (Human)
Description:
Q13255
Residue:
1194
  
Inhibitor
Name:
BDBM50163623
Synonyms:
(3-Ethyl-2-fluoro-quinolin-6-yl)-(4-methoxy-cyclohexyl)-methanone | CHEMBL179384
Type:
Small organic molecule
Emp. Form.:
C19H22FNO2
Mol. Mass.:
315.3819
SMILES:
CCc1cc2cc(ccc2nc1F)C(=O)C1CCC(CC1)OC
: