Target
Metabotropic glutamate receptor 4
Ligand
BDBM50038038
Substrate
Meas. Tech.
ChEMBL_310799 (CHEMBL835645)
EC50
>100000±n/a nM
Citation
 Triballeau, NAcher, FBrabet, IPin, JPBertrand, HO Virtual screening workflow development guided by the"receiver operating characteristic" curve approach. Application to high-throughput docking on metabotropic glutamate receptor subtype 4. J Med Chem 48:2534-47 (2005)  
Target
Name:
Metabotropic glutamate receptor 4
Synonyms:
GRM4_RAT Grm4 Metabotropic glutamate receptor 4 (mGlu4) mGlu4 metabotropic glutamate 4a
Type:
Enzyme
Mol. Mass.:
101849.79
Organism:
Rattus norvegicus (Rat)
Description:
P31423
Residue:
912
  
Inhibitor
Name:
BDBM50038038
Synonyms:
(S)-2-Amino-4-(3,5-dioxo-[1,2,4]oxadiazolidin-2-yl)-butyric acid CHEMBL126608
Type:
Small organic molecule
Emp. Form.:
C6H9N3O5
Mol. Mass.:
203.1528
SMILES:
N[C@@H](CCn1oc(=O)[nH]c1=O)C(O)=O
: