Target
Reverse transcriptase/RNaseH
Ligand
BDBM50164639
Substrate
Meas. Tech.
ChEMBL_302539 (CHEMBL875215)
Ki
25±n/a nM
Citation
 Boyle, NARajwanshi, VKPrhavc, MWang, GFagan, PChen, FEwing, GJBrooks, JLHurd, TLeeds, JMBruice, TWCook, PD Synthesis of 2',3'-dideoxynucleoside 5'-alpha-P-borano-beta,gamma-(difluoromethylene)triphosphates and their inhibition of HIV-1 reverse transcriptase. J Med Chem 48:2695-700 (2005)  
Target
Name:
Reverse transcriptase/RNaseH
Synonyms:
HIV-1 Reverse Transcriptase RNase H Reverse transcriptase/RNaseH
Type:
PROTEIN
Mol. Mass.:
65229.15
Organism:
Human immunodeficiency virus 1
Description:
ChEMBL_1473730
Residue:
566
  
Inhibitor
Name:
BDBM50164639
Synonyms:
2'-3'-dideoxy-7-deaza-guaninetriphosphate | CHEMBL195111
Type:
Small organic molecule
Emp. Form.:
C11H17N4O12P3
Mol. Mass.:
490.1936
SMILES:
NC1=NCc2c(ncn2[C@H]2CC[C@@H](COP(O)(=O)OP(O)(=O)OP(O)(O)=O)O2)C1=O
: