Target
Somatostatin receptor type 1
Ligand
BDBM50165166
Substrate
Meas. Tech.
ChEMBL_306862 (CHEMBL827597)
IC50
>10000±n/a nM
Citation
 Schottelius, MReubi, JCEltschinger, VSchwaiger, MWester, HJ N-terminal sugar conjugation and C-terminal Thr-for-Thr(ol) exchange in radioiodinated Tyr3-octreotide: effect on cellular ligand trafficking in vitro and tumor accumulation in vivo. J Med Chem 48:2778-89 (2005)  
Target
Name:
Somatostatin receptor type 1
Synonyms:
SOMATOSTATIN SST1 SS-1-R SS1R SSTR1 | Somatostatin receptor type 1 (SSTR1)
Type:
Enzyme
Mol. Mass.:
42692.81
Organism:
Homo sapiens (Human)
Description:
P30872
Residue:
391
  
Inhibitor
Name:
BDBM50165166
Synonyms:
CHEMBL441920 | Radiolabeled octreotide derivative
Type:
Small organic molecule
Emp. Form.:
C65H90N14O19S2
Mol. Mass.:
1435.623
SMILES:
C[C@@H](O)[C@H](NC(=O)[C@@H]1CSSC[C@H](NC(=O)[C@@H](Cc2ccccc2)NC(=O)CN2CCN(CC(O)=O)CCN(CC(O)=O)CCN(CC(O)=O)CC2)C(=O)N[C@@H](Cc2ccc(O)cc2)C(=O)N[C@H](Cc2c[nH]c3ccccc23)C(=O)N[C@@H](CCCCN)C(=O)N[C@@H]([C@@H](C)O)C(=O)N1)C(O)=O
: