Target
Integrin alpha-IIb/beta-3
Ligand
BDBM50172384
Substrate
Meas. Tech.
ChEMBL_321275 (CHEMBL881281)
IC50
14±n/a nM
Citation
 Nicolaou, KC Joys of molecules. 2. Endeavors in chemical biology and medicinal chemistry. J Med Chem 48:5613-38 (2005)  
Target
Name:
Integrin alpha-IIb/beta-3
Synonyms:
Glycoprotein IIb/IIIa
Type:
Mol. Mass.:
Description:
ASSAY_ID of EBI is 30109
Components:
This complex has 2 components.
Component 1
Name:
Integrin beta-3
Synonyms:
CD_antigen=CD61 GPIIIa ITGB3 Platelet membrane glycoprotein IIIa
Type:
Protein
Mol. Mass.:
87038.91
Organism:
Homo sapiens (Human)
Description:
P05106
Residue:
788
  
Component 2
Name:
Integrin alpha-IIb
Synonyms:
CD_antigen=CD41 GPIIb Glycoprotein IIb ITGA2B Integrin alpha-IIb heavy chain Integrin alpha-IIb light chain, form 2 Integrin alpha-V/beta-3 and alpha-IIb/beta 3 | Platelet membrane glycoprotein IIb
Type:
Protein
Mol. Mass.:
113354.85
Organism:
Homo sapiens (Human)
Description:
P08514
Residue:
1039
  
Inhibitor
Name:
BDBM50172384
Synonyms:
3-[4-(4-Carbamimidoyl-piperazin-1-yl)-3-nitro-benzoylamino]-2-((S)-2-hydroxy-naphthalene-1-sulfonylamino)-propionic acid | CHEMBL372481
Type:
Small organic molecule
Emp. Form.:
C25H27N7O8S
Mol. Mass.:
585.589
SMILES:
[#7]\[#6](-[#7-])=[#7+]-1\[#6]-[#6]-[#7](-[#6]-[#6]-1)-c1ccc(cc1-[#7+](-[#8-])=O)-[#6](=O)-[#7]-[#6]-[#6](-[#7]S(=O)(=O)c1c(-[#8])ccc2ccccc12)-[#6](-[#8])=O
: