Target
Amyloid-beta precursor protein
Ligand
BDBM50173646
Substrate
Meas. Tech.
ChEMBL_320894 (CHEMBL872393)
Ki
15±n/a nM
Citation
 Zhang, WOya, SKung, MPHou, CMaier, DLKung, HF F-18 stilbenes as PET imaging agents for detecting beta-amyloid plaques in the brain. J Med Chem 48:5980-8 (2005)  
Target
Name:
Amyloid-beta precursor protein
Synonyms:
A4 ABPP AICD-50 AICD-59 AID(57) APP Alzheimer disease amyloid protein Amyloid beta Protein Amyloid beta protein Abeta(1-42) Amyloid intracellular domain 57 Amyloid protein (Abeta42b) Beta amyloid A4 protein Beta-APP42 Beta-amyloid protein 42 C83 CVAP Gamma Secretase Gamma-CTF(57) Gamma-secretase Gamma-secretase C-terminal fragment 57 P3(40) PN-II Protease nexin-II S-APP-beta Soluble APP-beta | beta-Amyloid Precursor Protein (APP)
Type:
Single-pass type I membrane protein
Mol. Mass.:
86890.41
Organism:
Homo sapiens (Human)
Description:
P05067
Residue:
770
  
Inhibitor
Name:
BDBM50173646
Synonyms:
3-{4-[(E)-2-(4-Amino-phenyl)-vinyl]-phenoxy}-2-fluoromethyl-propan-1-ol | CHEMBL198597
Type:
Small organic molecule
Emp. Form.:
C18H20FNO2
Mol. Mass.:
301.3553
SMILES:
Nc1ccc(\C=C\c2ccc(OCC(CO)CF)cc2)cc1
: