Target
Sodium-dependent serotonin transporter
Ligand
BDBM50412114
Substrate
Meas. Tech.
ChEMBL_321062 (CHEMBL884947)
Ki
6.3±n/a nM
Citation
 Morphy, RRankovic, Z Designed multiple ligands. An emerging drug discovery paradigm. J Med Chem 48:6523-43 (2005)  
Target
Name:
Sodium-dependent serotonin transporter
Synonyms:
5-HT Transporter 5HTT SC6A4_HUMAN SLC6A4 Serotonin transporter (5HTT) Sodium-dependent serotonin transporter (SERT) | Solute carrier family 6 member 4
Type:
Multi-pass membrane protein
Mol. Mass.:
70322.51
Organism:
Homo sapiens (Human)
Description:
P31645
Residue:
630
  
Inhibitor
Name:
BDBM50412114
Synonyms:
CHEMBL183460 | SB-649915
Type:
Small organic molecule
Emp. Form.:
C26H29N3O3
Mol. Mass.:
431.5268
SMILES:
Cc1ccc2c(OCCN3CCC(Cc4ccc5OCC(=O)Nc5c4)CC3)cccc2n1
: