Target
D(2) dopamine receptor
Ligand
BDBM50145347
Substrate
Meas. Tech.
ChEMBL_320746 (CHEMBL881219)
Ki
4.7±n/a nM
Citation
 Morphy, RRankovic, Z Designed multiple ligands. An emerging drug discovery paradigm. J Med Chem 48:6523-43 (2005)  
Target
Name:
D(2) dopamine receptor
Synonyms:
D(2) dopamine receptor DOPAMINE D2 Long DRD2 Dopamine D2 receptor Dopamine D2 receptor (D2R) Dopamine2-like | d2
Type:
Cell-surface receptors
Mol. Mass.:
50647.10
Organism:
Homo sapiens (Human)
Description:
P14416
Residue:
443
  
Inhibitor
Name:
BDBM50145347
Synonyms:
1-(2-(4-(6-fluoro-1H-indol-3-yl)-5,6-dihydropyridin-1(2H)-yl)ethyl)-3,4-dihydro-1H-isochromene-6-carboxamide CHEMBL83617
Type:
Small organic molecule
Emp. Form.:
C25H26FN3O2
Mol. Mass.:
419.4912
SMILES:
NC(=O)c1ccc2C(CCN3CCC(=CC3)c3c[nH]c4cc(F)ccc34)OCCc2c1
: